{"text_format":"3","workbook":"xlsx","n_sheets":10,"sheets":["coverSheet","Worksheet 1","cockpit calculation ISO 11812","Table 4 calc","Table 4 ","Koeffient C1","C10","Table C2","Koef. C2 Table C3","Koef. C3 Table C4"],"not_rendered":{"charts":3,"images":3,"defined_names":3,"comments":4},"unopened":[{"sheet":"Table 4 ","index":4,"reason":"not_a_worksheet"}],"read":"whole","date_system":"1900"}

{"sheet":"coverSheet","index":0,"n_rows":29,"n_cols":1,"rows_kept":29,"merged":[[2,0,2,5],[4,1,4,5],[5,1,5,5],[6,1,6,5],[7,1,7,5],[8,1,8,5],[9,1,9,5],[10,1,10,5],[11,1,11,5],[13,0,13,5],[14,0,14,5],[16,0,16,1],[17,0,17,1],[19,0,20,5],[22,0,22,5],[24,0,24,5],[26,0,26,5],[28,0,28,5]]}
[]
[]
["ISO 11812:2001 Small craft - Watertight cockpits and quick-draining cockpits"]
[]
["Manufacturer:"]
["Signatory, Name:"]
["Signatory, Title:"]
["Phone:"]
["Email:"]
["WWW:"]
["CIN Model Year:"]
["Model Name:"]
[]
["This calculation sheet is provided by IMCI \"as is\" and any express or implied warranties, including, but not limited to, the implied warranties of fitness for a particular purpose are disclaimed."]
[]
[]
["blue cells are derived values"]
["yellow cells require data input"]
[]
[]
[]
[]
[" - These worksheets checks the requirements for cockpit drainage solely with the quick method of calculation for cockpits as described in clause 7.8.4 of ISO 11812 for single level cockpits. \nAnnex C or other methods may give other results for the required drainage area.\nNo multilevel cockpit calculation."]
[]
["  - Simplified calculation for drain pipes with a diameter between 25mm and 150mm; bigger ones cannot be calculated with this tool."]
[]
["  - Please attach other detailed information as appropriate, e.g. photos, sketches etc. for sill height, openings, companion way doors, practical tests etc."]
[]
["- Please send questions, found errors, typos, mistakes, ect. directly to ralf.dewender@imci.org or to the headoffice with info@imci.org; every comment helps us to provides you with a better version."]

{"sheet":"Worksheet 1","index":1,"n_rows":81,"n_cols":57,"rows_kept":81,"merged":[[0,0,0,9],[0,11,0,12],[1,0,1,9],[2,0,2,9],[3,0,3,3],[4,0,4,9],[6,14,6,18],[8,0,8,5],[10,11,10,14],[24,11,24,12],[29,11,36,18],[39,11,39,12],[39,13,39,31],[43,0,43,6],[44,0,44,6],[46,0,46,6],[47,0,47,6],[49,15,49,22],[50,15,50,18],[50,19,50,22],[51,19,51,22],[52,19,52,22],[53,19,53,22],[54,19,54,22],[57,0,57,9],[59,15,59,21],[61,16,61,18],[62,15,66,15],[62,16,62,18],[62,19,62,21],[63,17,63,18],[63,20,63,21],[64,11,64,13],[66,13,66,14],[68,13,68,14],[69,13,69,14],[70,13,70,14],[71,13,71,14],[72,15,72,26],[73,13,73,14],[73,16,73,33]]}
[{"$nulls":11},"Comments"]
["ISO 11812:2001 Small craft - Watertight cockpits and quick-draining cockpits",{"$nulls":11},"Derived values"]
["WORKSHEET No. 1 data entry",{"$nulls":11},"Input values"]
["ISO 11812 en190916"]
[{"$f":"CONCATENATE(coverSheet!B5,\"   \",coverSheet!B12)","v":"   "}]
[{"$nulls":28},"Power"]
["Design Category intended:",{"$nulls":4},"    Monohull / Multihull:",null,null,"Boat Type",{"$nulls":19},"Sail"]
[]
["Item",{"$nulls":5},"Symbol","Unit","Value","Ref.",{"$nulls":44},"list:","list:","list:"]
["Length of hull as in ISO 8666",{"$nulls":5},"LH","m",null,"3.2",{"$nulls":18},"A",{"$nulls":25},"A","Monohull","OB"]
["Beam of hull (max)",{"$nulls":5},"Bmax","m",null,"3.3",{"$nulls":18},"B",{"$nulls":25},"B","Multihull"]
["Freeboard amidships",{"$nulls":5},"FM","m",null,"3.5",null,"Additional drains with different diameter",{"$nulls":16},"C",{"$nulls":25},"C"]
["Cockpit Volume",{"$nulls":5},"VC","m³",null,"3.27",null,null,"number","diameter [mm]",null,"area of one drain [mm²]",{"$nulls":12},"D",{"$nulls":25},"D"]
["Cockpit water retention height",{"$nulls":5},"hC","m",null,"3.15",null,"drainsize 2",{"$nulls":3},{"$f":"(N14/2)^2*PI()","v":0}]
["Cockpit bottom height",{"$nulls":5},"hB","m",null,"3.16",null,"drainsize 3",{"$nulls":3},{"$f":"(N15/2)^2*PI()","v":0}]
["Drain lenght",{"$nulls":6},"m",{"$nulls":3},"sum of additional circular drain area",null,null,{"$f":"M14*P14+M15*P15","v":0},"mm²"]
["Number of drains",{"$nulls":6},". /.",{"$nulls":3},"Freeing ports or non-circular drains"]
["Actual Drain diameter",{"$nulls":6},"mm",{"$nulls":3},"please insert number and size of rectangular openings/drains"]
["Drain with / without elbow",{"$nulls":11},"number","length[mm]","width[mm]","area of one drain [mm²]",{"$nulls":12},"none"]
["Drain below  / above waterline",{"$nulls":8},"7.8.4.3",null," opening 1",{"$nulls":3},{"$f":"N20*O20","v":0},"clause 7.4.1",{"$nulls":11},"without flaps"]
["Area of additionall openings (transom door, freeing port, u.a.)",{"$nulls":6},"mm²",{"$f":"O23+L25+O16","v":0},null,null," opening 2",{"$nulls":3},{"$f":"N21*O21","v":0},"minimum dimensions are 20mm in one direction and at minimum an area of 500mm² !"]
["Freeing port with / without flaps",{"$nulls":10}," opening 3",{"$nulls":3},0,{"$nulls":11},"circular","with flaps"]
["Actual height of fixed sill",{"$nulls":5},"hS,min/2","m",null,"3.25",null,"sum of rectangular drain area",null,null,{"$f":"M20*P20+M21*P21+M22*P22","v":0},"mm²",{"$nulls":11},"other shapes"]
["Actual semifixed sill (mobile part) height",{"$nulls":5},"hS,min","m",null,"3.25",null,"Drain area of any other openings (pls insert only sum of all drainage areas which are not circular or rectangular) "]
["Degree of watertightness of the closing appliances in the cockpit (if applicable)",{"$nulls":12},"mm²",{"$nulls":14},1]
["Closing appliances on bottom and horizontal areas; actual degree of watertightness",{"$nulls":8},"9.2.1",{"$nulls":18},2]
["Closing appliances on cockpit sides up to hS,min; actual degree of watertightness",{"$nulls":8},"9.2.1",{"$nulls":18},3]
["Closing appl. on cockpit sides  betw. hS,min and 2 hS,min a; actual degree of watertightness",{"$nulls":8},"9.2.1",{"$nulls":18},4]
["Closing appliances on cockpit sides above 2 hS,min a; actual degree of watertightness",{"$nulls":8},"9.2.1",{"$nulls":18},"n.a."]
["Requirement results, general",{"$nulls":5},"Symbol","Unit","Value","Ref.",null,"7.8.4.4. (NOTE)\nThe time calculations given in Table 4 are for a draining time between a height of water hC = 0,40 m to a remaining 0,10 m of water, with two drains, each one 1,2 m long and a coefficient of head loss at the entry K = 0,06 (see D.3). \nFor different values of hC, the draining time is smaller (multiplied by coefficient C1 of Table C.1). The draining time for a freeing port fitted with flaps is considered as 150 % of the draining time without a flap, this assessment may be adjusted by a test.\nFor a non-circular drain section, the section area shall be the same as that of a circular drain.",{"$nulls":16},"with"]
{"$rows_left_out":52}
{"sheet":"cockpit calculation ISO 11812","index":2,"n_rows":151,"n_cols":21,"rows_kept":151,"hidden":true,"merged":[[2,1,2,6],[3,1,3,6],[49,0,49,11],[50,1,50,18],[61,0,61,11],[67,0,67,11],[68,0,68,1],[90,0,90,11],[91,0,91,1],[113,0,113,11],[126,0,126,6],[128,1,128,3],[129,0,133,0],[129,1,129,3],[129,4,129,6],[130,2,130,3],[130,5,130,6]]}
["Item rel. 0.1.1 / 12.09.07 UHU-Pro / vers. 2 dew 27.05.09",null,"Short Sign","Value","Unit","value range","ref. Clause","comment",null,"where to find on WS"]
[]
["Manufacturer",{"$f":"coverSheet!B5","v":0},{"$nulls":9},"listen"]
["model Designator",{"$f":"coverSheet!B12","v":0}]
[]
[null,"assessment date and shortsign"]
[{"$nulls":11},"Power"]
["Boat type",null,null,{"$f":"'Worksheet 1'!J7","v":0},null,"POWER, SAIL","3.1.2",{"$f":"IF(UPPER(D8) = \"POWER\", \"no comment\",(IF(D8 = \"SAIL\", \"no comment\", \"input boat type Power/Multi, Sail\")))","v":"input boat type Power/Multi, Sail"},{"$nulls":3},"Sail"]
[{"$nulls":7},{"$f":"IF(D8=\"\",\"Power = POWER\",\"\")","v":""}]
[{"$nulls":7},{"$f":"IF(D8=\"\",\"Multihull = POWER\",\"\")","v":""},{"$nulls":3},"A"]
[null,null,{"$f":"IF(D8=\"SAIL\",\"As\",\" \")","v":" "},null,{"$f":"IF(D8=\"SAIL\",\"m²\",\" \")","v":" "},null,null,{"$f":"IF(D8=\"\",\"Mono Sail = SAIL\",\"\")","v":""},{"$nulls":3},"B"]
["Design Category intended",null,null,{"$f":"'Worksheet 1'!D7","v":0},null,"A, B, C, D",null,{"$f":"IF(AND((D12<>\"A\"),(D12<>\"B\"),(D12<>\"C\"),(D12<>\"D\")),\"input des. category type\",\"no comment\")","v":"input des. category type"},{"$nulls":3},"C"]
[{"$nulls":11},"D"]
["Cockpit","Cockpit bottom height","hb",{"$f":"IF('Worksheet 1'!I15=\"\",\"\",'Worksheet 1'!I15)","v":""},"m",{"$f":"IF(D14=\"\",\"\",IF(D14>D34,\"Pass\",\"Fail\"))","v":""},"3.16",{"$f":"IF(ISBLANK(D14),\"input optional\",\"\")","v":""}]
[null,"Cockpit water retention height","hc",{"$f":"'Worksheet 1'!I14","v":{"v":0,"d":"0.00"}},"m",null,"3.15",{"$f":"IF(ISBLANK(D15),\"input required\",\"\")","v":""}]
[null,"Length of hull","Lh",{"$f":"'Worksheet 1'!I10","v":{"v":0,"d":"0.00"}},"m","2,5 to 24","3.2, 3.15",{"$f":"IF(D16<2.5,\"out of range\",IF(D16>24,\"out of range\",\"no comment\"))","v":"out of range"}]
[null,"Beam of hull","Bh",{"$f":"'Worksheet 1'!I11","v":{"v":0,"d":"0.00"}},"m",null,null,{"$f":"IF(ISBLANK(D17),\"input required\",\"\")","v":""}]
[null,"Beam of hull (max)","Bmax",{"$f":"'Worksheet 1'!I11","v":{"v":0,"d":"0.00"}},"m",null,"3.3, 3.15",{"$f":"IF(ISBLANK(D18),\"input required\",\"\")","v":""}]
[null,"Freeboard amidships","Fm",{"$f":"'Worksheet 1'!I12","v":{"v":0,"d":"0.00"}},"m",null,"3.5, 3.28",{"$f":"IF(ISBLANK(D19),\"input required\",\"\")","v":""}]
[null,"Cockpit Volume","Vc",{"$f":"'Worksheet 1'!I13","v":{"v":0,"d":"0.00"}},"m³",null,"3.27",{"$f":"IF(ISBLANK(D20),\"Cockpit Volume (below Hc)\",\"\")","v":""}]
[{"$nulls":11},"none"]
["Drainage measurements","Draining section (crossarea)",null,null,"m²",null,"7.2",{"$f":"\"min area: \"&0.05*D20&\" m²\"","v":"min area: 0 m²"},{"$nulls":3},"without flaps"]
[null,"shape of the cross-section",{"$nulls":5},{"$f":"IF(D23=\"circular\",\"\",\"req. Min. 20mm & 500mm²\")","v":"req. Min. 20mm & 500mm²"}]
[null,"Number of drains",null,{"$f":"'Worksheet 1'!I17","v":0},"./.",null,null,"insert either diameter and ",null,null,"circular","with flaps"]
[null,"actual Drain diameter","d",{"$f":"'Worksheet 1'!I18","v":{"v":0,"d":"0.00"}},"mm",null,"7.8","number of drains or/ and",null,null,"other shapes"]
[null,"additionall openings (transom door, freeing port, u.a.)",null,{"$f":"'Worksheet 1'!I21","v":{"v":0,"d":"0.00"}},"mm²",null,"7.4.2","drainage area"]
[null,"freeing port with/without flaps",null,{"$f":"IF('Worksheet 1'!I22=\"\",\"\",'Worksheet 1'!I22)","v":""},null,"none, with flaps, without flaps",null,{"$f":"IF(ISBLANK(D27),\"input required\",\"\")","v":""}]
[null,"Drain with/without elbow",null,{"$f":"'Worksheet 1'!I19","v":{"v":0,"d":"0.00"}},null,"with, without",null,{"$f":"IF(ISBLANK(D28),\"input required\",\"\")","v":""},{"$nulls":3},"with"]
[null,"Drain below/above waterline",null,{"$f":"'Worksheet 1'!I20","v":{"v":0,"d":"0.00"}},null,"below, above",null,{"$f":"IF(ISBLANK(D29),\"input required\",\"\")","v":""},{"$nulls":3},"without"]
[null,"drain lenght",null,{"$f":"IF('Worksheet 1'!I16=\"\",\"\",'Worksheet 1'!I16)","v":""},"m",null,null,{"$f":"IF(ISBLANK(D30),\"input required\",\"\")","v":""}]
{"$rows_left_out":122}
{"sheet":"Table 4 calc","index":3,"n_rows":39,"n_cols":18,"rows_kept":39,"hidden":true,"merged":[[3,0,21,0],[25,2,26,2]]}
[{"$nulls":10},"Transponierte Tabelle für Abfrage"]
[]
["Typical drain arrangement",null,"Drain outlet above WL, no elbow","Drain outlet above WL, two elbows","Drain outlet below WL, no elbow","Drain outlet below WL, two elbows","Freeing port above WL, no flap","Freeings port above WL, with flap","Drain diameter d (mm) two drains",null,null,"Drain outlet above WL, no elbow","Drain outlet above WL, two elbows","Drain outlet below WL, no elbow","Drain outlet below WL, two elbows","Freeing port above WL, no flap","Freeings port above WL, with flap","Drain diameter d (mm) two drains"]
["Values of tref (min)",{"$nulls":10},0.1,0.1,0.1,0.25,0.25,0.3,160]
[null,25,8.8,10,10.8,11.8,10.1,15.2,25,null,null,0.2,0.2,0.2,0.3,0.3,0.4,150]
[null,30,5.8,6.7,7.2,7.9,7,10.5,30,null,null,0.2,0.3,0.3,0.3,0.3,0.5,140]
[null,35,4.1,4.7,5.1,5.7,5.2,7.7,35,null,null,0.2,0.3,0.3,0.4,0.4,0.6,130]
[null,40,3,3.5,3.9,4.3,3.9,5.9,40,null,null,0.3,0.4,0.4,0.4,0.4,0.7,120]
[null,45,2.3,2.7,3,3.3,3.1,4.7,45,null,null,0.3,0.4,0.5,0.5,0.5,0.8,110]
[null,50,1.8,2.2,2.4,2.7,2.5,3.8,50,null,null,0.4,0.5,0.6,0.6,0.6,0.9,100]
[null,55,1.5,1.8,2,2.2,2.1,3.1,55,null,null,0.5,0.6,0.7,0.8,0.8,1.2,90]
[null,60,1.2,1.5,1.6,1.8,1.8,2.6,60,null,null,0.7,0.8,0.9,1,1,1.5,80]
[null,65,1,1.3,1.4,1.5,1.5,2.2,65,null,null,0.8,0.9,1,1.2,1.1,1.7,75]
[null,70,0.9,1.1,1.2,1.3,1.3,1.9,70,null,null,0.9,1.1,1.2,1.3,1.3,1.9,70]
[null,75,0.8,0.9,1,1.2,1.1,1.7,75,null,null,1,1.3,1.4,1.5,1.5,2.2,65]
[null,80,0.7,0.8,0.9,1,1,1.5,80,null,null,1.2,1.5,1.6,1.8,1.8,2.6,60]
[null,90,0.5,0.6,0.7,0.8,0.8,1.2,90,null,null,1.5,1.8,2,2.2,2.1,3.1,55]
[null,100,0.4,0.5,0.6,0.6,0.6,0.9,100,null,null,1.8,2.2,2.4,2.7,2.5,3.8,50]
[null,110,0.3,0.4,0.5,0.5,0.5,0.8,110,null,null,2.3,2.7,3,3.3,3.1,4.7,45]
[null,120,0.3,0.4,0.4,0.4,0.4,0.7,120,null,null,3,3.5,3.9,4.3,3.9,5.9,40]
[null,130,0.2,0.3,0.3,0.4,0.4,0.6,130,null,null,4.1,4.7,5.1,5.7,5.2,7.7,35]
[null,140,0.2,0.3,0.3,0.3,0.3,0.5,140,null,null,5.8,6.7,7.2,7.9,7,10.5,30]
[null,150,0.2,0.2,0.2,0.3,0.3,0.4,150,null,null,8.8,10,10.8,11.8,10.1,15.2,25]
[{"$nulls":11},"min 25mm","min 25mm","min 25mm","min 25mm","min 25mm","min 25mm"]
[]
[null,null,"above?\nbelow?"]
[null,"tref",null,"elbows?","freeing port"]
[null,{"$f":"'cockpit calculation ISO 11812'!D39","v":{"v":0,"d":"0.00000"}},{"$f":"'cockpit calculation ISO 11812'!D29","v":0},{"$f":"'cockpit calculation ISO 11812'!D28","v":0},{"$f":"'cockpit calculation ISO 11812'!D27","v":""}]
[]
[null,"erste Näherung Table 4 value",null,null,{"$f":"IF(B28<>\"\",IF(AND(C28<>\"\",D28<>\"\"),IF(AND(D28=\"without\",C28=\"below\"),LOOKUP($B$28,N4:N23,R4:R23),IF(AND(D28=\"with\",C28=\"below\"),LOOKUP($B$28,O4:O23,R4:R23),IF(AND(C28=\"above\",D28=\"without\"),LOOKUP($B$28,L4:L23,R4:R23),IF(AND(C28=\"above\",D28=\"with\"),LOOKUP($B$28,M4:M23,R4:R23)))))),\"\")","v":false},null,"geht auf den größeren Durchmesserwert"]
{"$rows_left_out":10}
{"sheet":"Koeffient C1","index":5,"n_rows":224,"n_cols":20,"rows_kept":224,"hidden":true,"merged":[[27,1,27,12]]}
["hc","C1"]
[{"v":0.2,"d":"0.20"},0.83]
[{"v":0.3,"d":"0.30"},0.98]
[{"v":0.4,"d":"0.40"},{"v":1,"d":"1.00"}]
[{"v":0.5,"d":"0.50"},0.99]
[{"v":0.6,"d":"0.60"},0.97]
[{"v":0.7,"d":"0.70"},0.94]
[{"v":0.8,"d":"0.80"},0.91]
[{"v":0.9,"d":"0.90"},0.89]
[{"v":1,"d":"1.00"},0.86]
[{"v":1.1,"d":"1.10"},0.84]
[{"v":1.2,"d":"1.20"},0.82]
[{"v":1.3,"d":"1.30"},{"v":0.8,"d":"0.80"}]
[{"v":1.4,"d":"1.40"},0.78]
[{"v":1.5,"d":"1.50"},0.77]
[{"v":1.6,"d":"1.60"},0.75]
[{"v":1.7,"d":"1.70"},0.73]
[{"v":1.8,"d":"1.80"},0.72]
[{"v":1.9,"d":"1.90"},0.71]
[{"v":2,"d":"2.00"},0.69]
{"$rows_empty":7}
[null,"Table C.1 — Values of C1 as a function of h"]
[]
["hC (m)",0.2,0.3,0.4,0.5,0.6,0.7,0.8,0.9,1,1.1,1.2,1.3,1.4,1.5,1.6,1.7,1.8,1.9,2]
["C1 = (t1,hC/t1,04)",0.83,0.98,1,0.99,0.97,0.94,0.91,0.89,0.86,0.84,0.82,0.8,0.78,0.77,0.75,0.73,0.72,0.71,0.69]
[]
[null,"hC (m)","C1 = (t1,hC/t1,04)",{"$nulls":3},"hc =","Koef. C1 ="]
[null,0.0999999999999999,0.83]
[null,0.11,0.83]
[null,0.12,0.83]
{"$rows_left_out":189}
{"sheet":"C10","index":6,"n_rows":20,"n_cols":5,"rows_kept":20,"hidden":true}
[null,"hc","C1"]
[1,{"v":0.2,"d":"0.20"},0.83,{"$f":"(0.000005*B2*B2*B2*B2*B2)-(0.0003*B2^4)+(0.0063*B2^3)-(0.0627*B2^2)+(0.2559*B2)+0.6457","v":{"v":0.6944219216,"d":"0.69442"}},{"$f":"(0.000005*A2*A2*A2*A2*A2)-(0.0003*A2^4)+(0.0063*A2^3)-(0.0627*A2^2)+(0.2559*A2)+0.6457","v":{"v":0.844905,"d":"0.84491"}}]
[2,{"v":0.3,"d":"0.30"},0.98,{"$f":"(0.000005*B3*B3*B3*B3*B3)-(0.0003*B3^4)+(0.0063*B3^3)-(0.0627*B3^2)+(0.2559*B3)+0.6457","v":{"v":0.7169946821500001,"d":"0.71699"}},{"$f":"(0.000005*A3*A3*A3*A3*A3)-(0.0003*A3^4)+(0.0063*A3^3)-(0.0627*A3^2)+(0.2559*A3)+0.6457","v":{"v":0.9524600000000001,"d":"0.95246"}}]
[3,{"v":0.4,"d":"0.40"},{"v":1,"d":"1.00"},{"v":0.7384235712,"d":"0.73842"},{"v":0.9961150000000001,"d":"0.99612"}]
[4,{"v":0.5,"d":"0.50"},0.99,{"v":0.7587439062500001,"d":"0.75874"},{"v":0.9976200000000001,"d":"0.99762"}]
[5,{"v":0.6,"d":"0.60"},0.97,{"v":0.7779903088000001,"d":"0.77799"},{"v":0.973325,"d":"0.97333"}]
[6,{"v":0.7,"d":"0.70"},0.94,{"v":0.7961967103500001,"d":"0.79620"},0.93478]
[7,{"v":0.8,"d":"0.80"},0.91,{"v":0.8133963584,"d":"0.81340"},{"v":0.8893349999999999,"d":"0.88934"}]
[8,{"v":0.9,"d":"0.90"},0.89,{"v":0.82962182245,"d":"0.82962"},{"v":0.8407399999999997,"d":"0.84074"}]
[9,{"v":1,"d":"1.00"},0.86,{"v":0.844905,"d":"0.84491"},{"v":0.7897449999999998,"d":"0.78975"}]
[10,{"v":1.1,"d":"1.10"},0.84,{"v":0.85927712255,"d":"0.85928"},{"v":0.7347,"d":"0.73470"}]
[11,{"v":1.2,"d":"1.20"},0.82,{"v":0.8727687616,"d":"0.87277"},{"v":0.6721550000000008,"d":"0.67216"}]
[12,{"v":1.3,"d":"1.30"},{"v":0.8,"d":"0.80"},{"v":0.8854098346500001,"d":"0.88541"},{"v":0.5974600000000002,"d":"0.59746"}]
[13,{"v":1.4,"d":"1.40"},0.78,{"v":0.8972296112,"d":"0.89723"},{"v":0.5053650000000011,"d":"0.50537"}]
[14,{"v":1.5,"d":"1.50"},0.77,{"v":0.9082567187500001,"d":"0.90826"},{"v":0.39061999999999963,"d":"0.39062"}]
[15,{"v":1.6,"d":"1.60"},0.75,{"v":0.9185191488000001,"d":"0.91852"},{"v":0.24857500000000143,"d":"0.24858"}]
[16,{"v":1.7,"d":"1.70"},0.73,{"v":0.9280442628500001,"d":"0.92804"},{"v":0.07578000000000029,"d":"0.07578"}]
[17,{"v":1.8,"d":"1.80"},0.72,{"v":0.9368587984000001,"d":"0.93686"},{"v":-0.1294149999999924,"d":"-0.12941"}]
[18,{"v":1.9,"d":"1.90"},0.71,{"v":0.9449888749500001,"d":"0.94499"},{"v":-0.36625999999999925,"d":"-0.36626"}]
[19,{"v":2,"d":"2.00"},0.69,{"v":0.9524600000000001,"d":"0.95246"},{"v":-0.6310049999999979,"d":"-0.63100"}]

{"sheet":"Table C2","index":7,"n_rows":138,"n_cols":21,"rows_kept":138,"hidden":true,"merged":[[0,1,0,12]]}
[null,"Table C.2 — Drain diameter as a function of tref /(C1C2) of tref /(C1C3)"]
[]
["tref /(C1C2) or tref /(C1C3)",9.47,6.06,4.21,3.09,2.37,1.87,1.52,1.25,1.05,0.9,0.77,0.67,0.59,0.47,0.38,0.31,0.26,0.22,0.19,0.17]
["Drain diameter (mm)",20,25,30,35,40,45,50,55,60,65,70,75,80,90,100,110,120,130,140,150]
[]
[]
[{"$nulls":4},"tref /(C1C2) or tref /(C1C3)","Drain diameter (mm)",null,"tref /(C1C2) or tref /(C1C3)","Berechneter Wert aus tref und C1 & C2(C3)"]
[{"$nulls":4},{"v":0.17,"d":"0.170"},150,{"$f":"(E18-E8)/10","v":0.001999999999999999},{"$f":"'cockpit calculation ISO 11812'!G40","v":{"$error":"#N/A"}}]
[{"$nulls":4},{"v":0.17200000000000001,"d":"0.172"},149]
[{"$nulls":4},{"v":0.17400000000000002,"d":"0.174"},148]
[{"$nulls":4},{"v":0.17600000000000002,"d":"0.176"},147]
[{"$nulls":4},{"v":0.17800000000000002,"d":"0.178"},146]
[{"$nulls":4},{"v":0.18,"d":"0.180"},145]
[{"$nulls":4},{"v":0.18200000000000002,"d":"0.182"},144]
[{"$nulls":4},{"v":0.18400000000000002,"d":"0.184"},143]
[{"$nulls":4},{"v":0.18600000000000003,"d":"0.186"},142]
[{"$nulls":4},{"v":0.18800000000000003,"d":"0.188"},141]
[{"$nulls":4},{"v":0.19,"d":"0.190"},140,{"$f":"(E28-E18)/10","v":0.003},{"$f":"LOOKUP(H8,E8:E138,F8:F138)","v":{"$error":"#N/A"}},"auf 1mm genauer Tabellenwert drain diameter aus table c.2"]
[{"$nulls":4},0.193,139]
[{"$nulls":4},0.196,138]
[{"$nulls":4},0.199,137]
[{"$nulls":4},0.202,136]
[{"$nulls":4},0.205,135]
[{"$nulls":4},{"v":0.20800000000000002,"d":"0.208"},134]
[{"$nulls":4},{"v":0.21100000000000002,"d":"0.211"},133]
[{"$nulls":4},{"v":0.21400000000000002,"d":"0.214"},132]
[{"$nulls":4},{"v":0.21700000000000003,"d":"0.217"},131]
[{"$nulls":4},{"v":0.22,"d":"0.220"},130,{"$f":"(E38-E28)/10","v":4.000000000000001E-3}]
[{"$nulls":4},0.224,129]
[{"$nulls":4},0.228,128]
{"$rows_left_out":109}
{"sheet":"Koef. C2 Table C3","index":8,"n_rows":29,"n_cols":9,"rows_kept":29,"hidden":true,"merged":[[2,1,2,8]]}
[]
[]
[null,"Table C.3 — Values of C2 for hC = 0,4 m and drain outlet above the waterline"]
["Drain length L(m)","Drain lengthL (m)",null,0.2,0.4,0.6,0.8,1,1.2]
[null,"Drain",25,1.1,1.18,1.25,1.32,1.38,1.45]
[null,null,30,1.09,1.15,1.21,1.26,1.31,1.37]
[null,"diameter",35,1.08,1.13,1.18,1.22,1.27,1.31]
[null,null,40,1.07,1.11,1.15,1.19,1.23,1.27]
[null,"d (mm) =",45,1.07,1.1,1.14,1.17,1.21,1.24]
[null,null,50,1.06,1.09,1.12,1.15,1.18,1.21]
[null,null,55,1.06,1.09,1.11,1.14,1.17,1.19]
[null,null,60,1.05,1.08,1.11,1.13,1.15,1.18]
[null,null,65,1.05,1.08,1.1,1.12,1.14,1.16]
[null,null,70,1.05,1.07,1.09,1.11,1.13,1.12]
[null,null,80,1.05,1.06,1.08,1.1,1.12,1.13]
[null,null,90,1.04,1.06,1.08,1.09,1.11,1.12]
[null,null,100,1.04,1.06,1.07,1.08,1.1,1.11]
[null,null,110,1.04,1.05,1.07,1.08,1.09,1.1]
[null,null,120,1.04,1.05,1.06,1.08,1.08,1.09]
[null,null,130,1.04,1.05,1.06,1.07,1.08,1.09]
[null,null,140,1.04,1.05,1.06,1.07,1.07,1.08]
[null,null,150,1.04,1.05,1.05,1.06,1.07,1.08]
[]
[{"$nulls":3},"C2 ",{"$f":"IF(D26=0,\"\",VLOOKUP(D29,C5:I22,D28,TRUE))","v":{"$error":"#N/A"}}]
[{"$nulls":4},"rounded"]
[null,"actual drain length ",null,{"$f":"'cockpit calculation ISO 11812'!D30","v":""},{"$f":"EVEN(ROUNDDOWN(D26,1)*10)/10","v":{"$error":"#VALUE!"}}]
[null,"rounded drain length",null,{"$f":"IF(E26>1.2,1.2,E26)","v":{"$error":"#VALUE!"}},null,"z.Zt 1,2 größter Tabellenwert; zu ändern"]
[null,"suchkriterium",null,{"$f":"D27/0.2+1","v":{"$error":"#VALUE!"}}]
[null,"first value drain diameter",null,{"$f":"'cockpit calculation ISO 11812'!D41","v":false}]

{"sheet":"Koef. C3 Table C4","index":9,"n_rows":29,"n_cols":9,"rows_kept":29,"hidden":true,"merged":[[2,1,2,8],[3,1,3,2]]}
[]
[]
[null,"Table C.4 — Values of C3 for hC = 0,4 m and drain outlet below the waterline"]
["Drain length L(m)","Drain length L (m)",null,0.2,0.4,0.6,0.8,1,1.2]
[null,"Drain",25,1.49,1.55,1.61,1.67,1.72,1.77]
[null,null,30,1.48,1.53,1.57,1.62,1.66,1.71]
[null,"diameter",35,1.47,1.51,1.55,1.59,1.63,1.69]
[null,null,40,1.47,1.5,1.53,1.57,1.6,1.63]
[null,"d (mm) =",45,1.46,1.49,1.52,1.55,1.58,1.6]
[null,null,50,1.46,1.49,1.51,1.53,1.56,1.58]
[null,null,55,1.46,1.48,1.5,1.52,1.54,1.57]
[null,null,60,1.46,1.47,1.49,1.51,1.53,1.55]
[null,null,65,1.45,1.47,1.49,1.51,1.52,1.54]
[null,null,70,1.45,1.47,1.48,1.5,1.52,1.53]
[null,null,80,1.45,1.46,1.48,1.49,1.5,1.52]
[null,null,90,1.45,1.46,1.47,1.48,1.49,1.51]
[null,null,100,1.45,1.46,1.47,1.48,1.49,1.5]
[null,null,110,1.44,1.45,1.46,1.47,1.48,1.49]
[null,null,120,1.44,1.45,1.46,1.47,1.48,1.49]
[null,null,130,1.44,1.45,1.46,1.47,1.48,1.49]
[null,null,140,1.44,1.45,1.46,1.46,1.47,1.48]
[null,null,150,1.44,1.45,1.45,1.46,1.47,1.47]
[]
[{"$nulls":3},"C2 ",{"$f":"VLOOKUP(D29,C5:I22,D28,TRUE)","v":{"$error":"#N/A"}}]
[{"$nulls":4},"rounded"]
[null,"actual drain length ",null,{"$f":"'cockpit calculation ISO 11812'!D30","v":""},{"$f":"EVEN(ROUNDDOWN(D26,1)*10)/10","v":{"$error":"#VALUE!"}}]
[null,"rounded drain length",null,{"$f":"IF(E26>1.2,1.2,E26)","v":{"$error":"#VALUE!"}},null,"z.Zt 1,2 größter Tabellenwert; zu ändern"]
[null,"suchkriterium",null,{"$f":"D27/0.2+1","v":{"$error":"#VALUE!"}}]
[null,"first value drain diameter",null,{"$f":"'cockpit calculation ISO 11812'!D41","v":false}]